tests.txt 28.4 KB
Newer Older
Kirill Terekhov's avatar
Kirill Terekhov committed
1
1>------ Build started: Project: RUN_TESTS, Configuration: Release x64 ------
Kirill Terekhov's avatar
Kirill Terekhov committed
2
1>Build started 13.03.2015 3:06:21.
Kirill Terekhov's avatar
Kirill Terekhov committed
3
1>InitializeBuildStatus:
Kirill Terekhov's avatar
Kirill Terekhov committed
4
1>  Creating "x64\Release\RUN_TESTS\RUN_TESTS.unsuccessfulbuild" because "AlwaysCreate" was specified.
Kirill Terekhov's avatar
Kirill Terekhov committed
5 6 7
1>PostBuildEvent:
1>  Test project C:/Users/KIRILL/Documents/Code/INMOST/builds/build64_2010_INMOST
1>          Start   1: solver_test000_serial_inner_ilu2
Kirill Terekhov's avatar
Kirill Terekhov committed
8
1>    1/165 Test   #1: solver_test000_serial_inner_ilu2 ...................   Passed    0.02 sec
Kirill Terekhov's avatar
Kirill Terekhov committed
9
1>          Start   2: solver_test000_serial_inner_ddpqiluc
Kirill Terekhov's avatar
Kirill Terekhov committed
10
1>    2/165 Test   #2: solver_test000_serial_inner_ddpqiluc ...............   Passed    0.02 sec
Kirill Terekhov's avatar
Kirill Terekhov committed
11
1>          Start   3: solver_test000_serial_inner_mptiluc
Kirill Terekhov's avatar
Kirill Terekhov committed
12
1>    3/165 Test   #3: solver_test000_serial_inner_mptiluc ................   Passed    0.02 sec
Kirill Terekhov's avatar
Kirill Terekhov committed
13
1>          Start   4: solver_test000_serial_petsc
Kirill Terekhov's avatar
Kirill Terekhov committed
14
1>    4/165 Test   #4: solver_test000_serial_petsc ........................   Passed    0.02 sec
Kirill Terekhov's avatar
Kirill Terekhov committed
15
1>          Start   5: solver_test000_serial_trilinos_aztec
Kirill Terekhov's avatar
Kirill Terekhov committed
16
1>    5/165 Test   #5: solver_test000_serial_trilinos_aztec ...............   Passed    0.02 sec
Kirill Terekhov's avatar
Kirill Terekhov committed
17
1>          Start   6: solver_test000_serial_trilinos_ifpack
Kirill Terekhov's avatar
Kirill Terekhov committed
18
1>    6/165 Test   #6: solver_test000_serial_trilinos_ifpack ..............   Passed    0.02 sec
Kirill Terekhov's avatar
Kirill Terekhov committed
19
1>          Start   7: solver_test000_serial_trilinos_ml
Kirill Terekhov's avatar
Kirill Terekhov committed
20
1>    7/165 Test   #7: solver_test000_serial_trilinos_ml ..................   Passed    0.03 sec
Kirill Terekhov's avatar
Kirill Terekhov committed
21
1>          Start   8: solver_test000_serial_trilinos_belos
Kirill Terekhov's avatar
Kirill Terekhov committed
22
1>    8/165 Test   #8: solver_test000_serial_trilinos_belos ...............   Passed    0.02 sec
Kirill Terekhov's avatar
Kirill Terekhov committed
23
1>          Start   9: solver_test000_parallel_normal_inner_ilu2
Kirill Terekhov's avatar
Kirill Terekhov committed
24
1>    9/165 Test   #9: solver_test000_parallel_normal_inner_ilu2 ..........   Passed    0.06 sec
Kirill Terekhov's avatar
Kirill Terekhov committed
25
1>          Start  10: solver_test000_parallel_permute1_inner_ilu2
Kirill Terekhov's avatar
Kirill Terekhov committed
26
1>   10/165 Test  #10: solver_test000_parallel_permute1_inner_ilu2 ........   Passed    0.06 sec
Kirill Terekhov's avatar
Kirill Terekhov committed
27
1>          Start  11: solver_test000_parallel_permute2_inner_ilu2
Kirill Terekhov's avatar
Kirill Terekhov committed
28
1>   11/165 Test  #11: solver_test000_parallel_permute2_inner_ilu2 ........   Passed    0.05 sec
Kirill Terekhov's avatar
Kirill Terekhov committed
29
1>          Start  12: solver_test000_parallel_normal_inner_ddpqiluc
Kirill Terekhov's avatar
Kirill Terekhov committed
30
1>   12/165 Test  #12: solver_test000_parallel_normal_inner_ddpqiluc ......   Passed    0.06 sec
Kirill Terekhov's avatar
Kirill Terekhov committed
31
1>          Start  13: solver_test000_parallel_permute1_inner_ddpqiluc
Kirill Terekhov's avatar
Kirill Terekhov committed
32
1>   13/165 Test  #13: solver_test000_parallel_permute1_inner_ddpqiluc ....   Passed    0.06 sec
Kirill Terekhov's avatar
Kirill Terekhov committed
33
1>          Start  14: solver_test000_parallel_permute2_inner_ddpqiluc
Kirill Terekhov's avatar
Kirill Terekhov committed
34
1>   14/165 Test  #14: solver_test000_parallel_permute2_inner_ddpqiluc ....   Passed    0.06 sec
Kirill Terekhov's avatar
Kirill Terekhov committed
35
1>          Start  15: solver_test000_parallel_normal_inner_mptiluc
Kirill Terekhov's avatar
Kirill Terekhov committed
36
1>   15/165 Test  #15: solver_test000_parallel_normal_inner_mptiluc .......   Passed    0.06 sec
Kirill Terekhov's avatar
Kirill Terekhov committed
37
1>          Start  16: solver_test000_parallel_permute1_inner_mptiluc
Kirill Terekhov's avatar
Kirill Terekhov committed
38
1>   16/165 Test  #16: solver_test000_parallel_permute1_inner_mptiluc .....   Passed    0.06 sec
Kirill Terekhov's avatar
Kirill Terekhov committed
39
1>          Start  17: solver_test000_parallel_permute2_inner_mptiluc
Kirill Terekhov's avatar
Kirill Terekhov committed
40
1>   17/165 Test  #17: solver_test000_parallel_permute2_inner_mptiluc .....   Passed    0.06 sec
Kirill Terekhov's avatar
Kirill Terekhov committed
41
1>          Start  18: solver_test000_parallel_normal_petsc
Kirill Terekhov's avatar
Kirill Terekhov committed
42
1>   18/165 Test  #18: solver_test000_parallel_normal_petsc ...............   Passed    0.06 sec
Kirill Terekhov's avatar
Kirill Terekhov committed
43
1>          Start  19: solver_test000_parallel_normal_trilinos_aztec
Kirill Terekhov's avatar
Kirill Terekhov committed
44
1>   19/165 Test  #19: solver_test000_parallel_normal_trilinos_aztec ......   Passed    0.06 sec
Kirill Terekhov's avatar
Kirill Terekhov committed
45
1>          Start  20: solver_test000_parallel_permute1_trilinos_aztec
Kirill Terekhov's avatar
Kirill Terekhov committed
46
1>   20/165 Test  #20: solver_test000_parallel_permute1_trilinos_aztec ....   Passed    0.06 sec
Kirill Terekhov's avatar
Kirill Terekhov committed
47
1>          Start  21: solver_test000_parallel_permute2_trilinos_aztec
Kirill Terekhov's avatar
Kirill Terekhov committed
48
1>   21/165 Test  #21: solver_test000_parallel_permute2_trilinos_aztec ....   Passed    0.06 sec
Kirill Terekhov's avatar
Kirill Terekhov committed
49
1>          Start  22: solver_test000_parallel_normal_trilinos_ifpack
Kirill Terekhov's avatar
Kirill Terekhov committed
50
1>   22/165 Test  #22: solver_test000_parallel_normal_trilinos_ifpack .....   Passed    0.06 sec
Kirill Terekhov's avatar
Kirill Terekhov committed
51
1>          Start  23: solver_test000_parallel_permute1_trilinos_ifpack
Kirill Terekhov's avatar
Kirill Terekhov committed
52
1>   23/165 Test  #23: solver_test000_parallel_permute1_trilinos_ifpack ...   Passed    0.06 sec
Kirill Terekhov's avatar
Kirill Terekhov committed
53
1>          Start  24: solver_test000_parallel_permute2_trilinos_ifpack
Kirill Terekhov's avatar
Kirill Terekhov committed
54
1>   24/165 Test  #24: solver_test000_parallel_permute2_trilinos_ifpack ...   Passed    0.09 sec
Kirill Terekhov's avatar
Kirill Terekhov committed
55
1>          Start  25: solver_test000_parallel_normal_trilinos_ml
Kirill Terekhov's avatar
Kirill Terekhov committed
56
1>   25/165 Test  #25: solver_test000_parallel_normal_trilinos_ml .........   Passed    0.08 sec
Kirill Terekhov's avatar
Kirill Terekhov committed
57
1>          Start  26: solver_test000_parallel_permute1_trilinos_ml
Kirill Terekhov's avatar
Kirill Terekhov committed
58
1>   26/165 Test  #26: solver_test000_parallel_permute1_trilinos_ml .......   Passed    0.06 sec
Kirill Terekhov's avatar
Kirill Terekhov committed
59
1>          Start  27: solver_test000_parallel_permute2_trilinos_ml
Kirill Terekhov's avatar
Kirill Terekhov committed
60
1>   27/165 Test  #27: solver_test000_parallel_permute2_trilinos_ml .......   Passed    0.06 sec
Kirill Terekhov's avatar
Kirill Terekhov committed
61
1>          Start  28: solver_test001_sparsekit_tokamak_utm300
Kirill Terekhov's avatar
Kirill Terekhov committed
62
1>   28/165 Test  #28: solver_test001_sparsekit_tokamak_utm300 ............   Passed    0.03 sec
Kirill Terekhov's avatar
Kirill Terekhov committed
63
1>          Start  29: solver_test001_sparsekit_tokamak_utm1700a
Kirill Terekhov's avatar
Kirill Terekhov committed
64
1>   29/165 Test  #29: solver_test001_sparsekit_tokamak_utm1700a ..........   Passed    0.20 sec
Kirill Terekhov's avatar
Kirill Terekhov committed
65
1>          Start  30: solver_test001_sparsekit_tokamak_utm1700b
Kirill Terekhov's avatar
Kirill Terekhov committed
66
1>   30/165 Test  #30: solver_test001_sparsekit_tokamak_utm1700b ..........   Passed    0.25 sec
Kirill Terekhov's avatar
Kirill Terekhov committed
67
1>          Start  31: solver_test001_sparsekit_tokamak_utm3060
Kirill Terekhov's avatar
Kirill Terekhov committed
68
1>   31/165 Test  #31: solver_test001_sparsekit_tokamak_utm3060 ...........   Passed    0.44 sec
Kirill Terekhov's avatar
Kirill Terekhov committed
69
1>          Start  32: solver_test001_sparsekit_tokamak_utm5940
Kirill Terekhov's avatar
Kirill Terekhov committed
70
1>   32/165 Test  #32: solver_test001_sparsekit_tokamak_utm5940 ...........   Passed    1.87 sec
Kirill Terekhov's avatar
Kirill Terekhov committed
71
1>          Start  33: solver_test001_sparsekit_drivcav_old_cavity01
Kirill Terekhov's avatar
Kirill Terekhov committed
72
1>   33/165 Test  #33: solver_test001_sparsekit_drivcav_old_cavity01 ......   Passed    0.06 sec
Kirill Terekhov's avatar
Kirill Terekhov committed
73
1>          Start  34: solver_test001_sparsekit_drivcav_old_cavity02
Kirill Terekhov's avatar
Kirill Terekhov committed
74
1>   34/165 Test  #34: solver_test001_sparsekit_drivcav_old_cavity02 ......   Passed    0.05 sec
Kirill Terekhov's avatar
Kirill Terekhov committed
75
1>          Start  35: solver_test001_sparsekit_drivcav_old_cavity03
Kirill Terekhov's avatar
Kirill Terekhov committed
76
1>   35/165 Test  #35: solver_test001_sparsekit_drivcav_old_cavity03 ......   Passed    0.06 sec
Kirill Terekhov's avatar
Kirill Terekhov committed
77
1>          Start  36: solver_test001_sparsekit_drivcav_old_cavity04
Kirill Terekhov's avatar
Kirill Terekhov committed
78
1>   36/165 Test  #36: solver_test001_sparsekit_drivcav_old_cavity04 ......   Passed    0.06 sec
Kirill Terekhov's avatar
Kirill Terekhov committed
79
1>          Start  37: solver_test001_sparsekit_drivcav_old_cavity05
Kirill Terekhov's avatar
Kirill Terekhov committed
80
1>   37/165 Test  #37: solver_test001_sparsekit_drivcav_old_cavity05 ......   Passed    0.19 sec
Kirill Terekhov's avatar
Kirill Terekhov committed
81
1>          Start  38: solver_test001_sparsekit_drivcav_old_cavity06
Kirill Terekhov's avatar
Kirill Terekhov committed
82
1>   38/165 Test  #38: solver_test001_sparsekit_drivcav_old_cavity06 ......   Passed    0.23 sec
Kirill Terekhov's avatar
Kirill Terekhov committed
83
1>          Start  39: solver_test001_sparsekit_drivcav_old_cavity07
Kirill Terekhov's avatar
Kirill Terekhov committed
84
1>   39/165 Test  #39: solver_test001_sparsekit_drivcav_old_cavity07 ......   Passed    0.18 sec
Kirill Terekhov's avatar
Kirill Terekhov committed
85
1>          Start  40: solver_test001_sparsekit_drivcav_old_cavity08
Kirill Terekhov's avatar
Kirill Terekhov committed
86
1>   40/165 Test  #40: solver_test001_sparsekit_drivcav_old_cavity08 ......   Passed    0.19 sec
Kirill Terekhov's avatar
Kirill Terekhov committed
87
1>          Start  41: solver_test001_sparsekit_drivcav_old_cavity09
Kirill Terekhov's avatar
Kirill Terekhov committed
88
1>   41/165 Test  #41: solver_test001_sparsekit_drivcav_old_cavity09 ......   Passed    0.20 sec
Kirill Terekhov's avatar
Kirill Terekhov committed
89
1>          Start  42: solver_test001_sparsekit_drivcav_old_cavity10
Kirill Terekhov's avatar
Kirill Terekhov committed
90
1>   42/165 Test  #42: solver_test001_sparsekit_drivcav_old_cavity10 ......   Passed    0.55 sec
Kirill Terekhov's avatar
Kirill Terekhov committed
91
1>          Start  43: solver_test001_sparsekit_drivcav_old_cavity11
Kirill Terekhov's avatar
Kirill Terekhov committed
92
1>   43/165 Test  #43: solver_test001_sparsekit_drivcav_old_cavity11 ......   Passed    0.55 sec
Kirill Terekhov's avatar
Kirill Terekhov committed
93
1>          Start  44: solver_test001_sparsekit_drivcav_old_cavity12
Kirill Terekhov's avatar
Kirill Terekhov committed
94
1>   44/165 Test  #44: solver_test001_sparsekit_drivcav_old_cavity12 ......   Passed    0.53 sec
Kirill Terekhov's avatar
Kirill Terekhov committed
95
1>          Start  45: solver_test001_sparsekit_drivcav_old_cavity13
Kirill Terekhov's avatar
Kirill Terekhov committed
96
1>   45/165 Test  #45: solver_test001_sparsekit_drivcav_old_cavity13 ......   Passed    0.53 sec
Kirill Terekhov's avatar
Kirill Terekhov committed
97
1>          Start  46: solver_test001_sparsekit_drivcav_old_cavity14
Kirill Terekhov's avatar
Kirill Terekhov committed
98
1>   46/165 Test  #46: solver_test001_sparsekit_drivcav_old_cavity14 ......   Passed    0.55 sec
Kirill Terekhov's avatar
Kirill Terekhov committed
99
1>          Start  47: solver_test001_sparsekit_drivcav_old_cavity15
Kirill Terekhov's avatar
Kirill Terekhov committed
100
1>   47/165 Test  #47: solver_test001_sparsekit_drivcav_old_cavity15 ......   Passed    0.50 sec
Kirill Terekhov's avatar
Kirill Terekhov committed
101
1>          Start  48: solver_test001_sparsekit_drivcav_old_cavity16
Kirill Terekhov's avatar
Kirill Terekhov committed
102
1>   48/165 Test  #48: solver_test001_sparsekit_drivcav_old_cavity16 ......   Passed    1.19 sec
Kirill Terekhov's avatar
Kirill Terekhov committed
103
1>          Start  49: solver_test001_sparsekit_drivcav_old_cavity17
Kirill Terekhov's avatar
Kirill Terekhov committed
104
1>   49/165 Test  #49: solver_test001_sparsekit_drivcav_old_cavity17 ......   Passed    1.23 sec
Kirill Terekhov's avatar
Kirill Terekhov committed
105
1>          Start  50: solver_test001_sparsekit_drivcav_old_cavity18
Kirill Terekhov's avatar
Kirill Terekhov committed
106
1>   50/165 Test  #50: solver_test001_sparsekit_drivcav_old_cavity18 ......   Passed    1.15 sec
Kirill Terekhov's avatar
Kirill Terekhov committed
107
1>          Start  51: solver_test001_sparsekit_drivcav_old_cavity19
Kirill Terekhov's avatar
Kirill Terekhov committed
108
1>   51/165 Test  #51: solver_test001_sparsekit_drivcav_old_cavity19 ......   Passed    1.23 sec
Kirill Terekhov's avatar
Kirill Terekhov committed
109
1>          Start  52: solver_test001_sparsekit_drivcav_old_cavity20
Kirill Terekhov's avatar
Kirill Terekhov committed
110
1>   52/165 Test  #52: solver_test001_sparsekit_drivcav_old_cavity20 ......   Passed    1.23 sec
Kirill Terekhov's avatar
Kirill Terekhov committed
111
1>          Start  53: solver_test001_sparsekit_drivcav_old_cavity21
Kirill Terekhov's avatar
Kirill Terekhov committed
112
1>   53/165 Test  #53: solver_test001_sparsekit_drivcav_old_cavity21 ......   Passed    1.25 sec
Kirill Terekhov's avatar
Kirill Terekhov committed
113
1>          Start  54: solver_test001_sparsekit_drivcav_old_cavity22
Kirill Terekhov's avatar
Kirill Terekhov committed
114
1>   54/165 Test  #54: solver_test001_sparsekit_drivcav_old_cavity22 ......   Passed    1.25 sec
Kirill Terekhov's avatar
Kirill Terekhov committed
115
1>          Start  55: solver_test001_sparsekit_drivcav_old_cavity23
Kirill Terekhov's avatar
Kirill Terekhov committed
116
1>   55/165 Test  #55: solver_test001_sparsekit_drivcav_old_cavity23 ......   Passed    1.26 sec
Kirill Terekhov's avatar
Kirill Terekhov committed
117
1>          Start  56: solver_test001_sparsekit_drivcav_old_cavity24
Kirill Terekhov's avatar
Kirill Terekhov committed
118
1>   56/165 Test  #56: solver_test001_sparsekit_drivcav_old_cavity24 ......   Passed    1.34 sec
Kirill Terekhov's avatar
Kirill Terekhov committed
119
1>          Start  57: solver_test001_sparsekit_drivcav_old_cavity25
Kirill Terekhov's avatar
Kirill Terekhov committed
120
1>   57/165 Test  #57: solver_test001_sparsekit_drivcav_old_cavity25 ......   Passed    1.22 sec
Kirill Terekhov's avatar
Kirill Terekhov committed
121
1>          Start  58: solver_test001_sparsekit_drivcav_old_cavity26
Kirill Terekhov's avatar
Kirill Terekhov committed
122
1>   58/165 Test  #58: solver_test001_sparsekit_drivcav_old_cavity26 ......   Passed    1.28 sec
Kirill Terekhov's avatar
Kirill Terekhov committed
123
1>          Start  59: solver_test001_sparsekit_drivcav_e05r0000
Kirill Terekhov's avatar
Kirill Terekhov committed
124
1>   59/165 Test  #59: solver_test001_sparsekit_drivcav_e05r0000 ..........   Passed    0.05 sec
Kirill Terekhov's avatar
Kirill Terekhov committed
125
1>          Start  60: solver_test001_sparsekit_drivcav_e05r0100
Kirill Terekhov's avatar
Kirill Terekhov committed
126
1>   60/165 Test  #60: solver_test001_sparsekit_drivcav_e05r0100 ..........   Passed    0.03 sec
Kirill Terekhov's avatar
Kirill Terekhov committed
127
1>          Start  61: solver_test001_sparsekit_drivcav_e05r0200
Kirill Terekhov's avatar
Kirill Terekhov committed
128
1>   61/165 Test  #61: solver_test001_sparsekit_drivcav_e05r0200 ..........   Passed    0.03 sec
Kirill Terekhov's avatar
Kirill Terekhov committed
129
1>          Start  62: solver_test001_sparsekit_drivcav_e05r0300
Kirill Terekhov's avatar
Kirill Terekhov committed
130
1>   62/165 Test  #62: solver_test001_sparsekit_drivcav_e05r0300 ..........   Passed    0.05 sec
Kirill Terekhov's avatar
Kirill Terekhov committed
131
1>          Start  63: solver_test001_sparsekit_drivcav_e05r0400
Kirill Terekhov's avatar
Kirill Terekhov committed
132
1>   63/165 Test  #63: solver_test001_sparsekit_drivcav_e05r0400 ..........   Passed    0.05 sec
Kirill Terekhov's avatar
Kirill Terekhov committed
133
1>          Start  64: solver_test001_sparsekit_drivcav_e05r0500
Kirill Terekhov's avatar
Kirill Terekhov committed
134
1>   64/165 Test  #64: solver_test001_sparsekit_drivcav_e05r0500 ..........   Passed    0.05 sec
Kirill Terekhov's avatar
Kirill Terekhov committed
135
1>          Start  65: solver_test001_sparsekit_drivcav_e20r0000
Kirill Terekhov's avatar
Kirill Terekhov committed
136
1>   65/165 Test  #65: solver_test001_sparsekit_drivcav_e20r0000 ..........   Passed    1.12 sec
Kirill Terekhov's avatar
Kirill Terekhov committed
137
1>          Start  66: solver_test001_sparsekit_drivcav_e20r0100
Kirill Terekhov's avatar
Kirill Terekhov committed
138
1>   66/165 Test  #66: solver_test001_sparsekit_drivcav_e20r0100 ..........   Passed    1.12 sec
Kirill Terekhov's avatar
Kirill Terekhov committed
139
1>          Start  67: solver_test001_sparsekit_drivcav_e20r0500
Kirill Terekhov's avatar
Kirill Terekhov committed
140
1>   67/165 Test  #67: solver_test001_sparsekit_drivcav_e20r0500 ..........   Passed    1.05 sec
Kirill Terekhov's avatar
Kirill Terekhov committed
141
1>          Start  68: solver_test001_sparsekit_drivcav_e20r1000
Kirill Terekhov's avatar
Kirill Terekhov committed
142
1>   68/165 Test  #68: solver_test001_sparsekit_drivcav_e20r1000 ..........   Passed    1.19 sec
Kirill Terekhov's avatar
Kirill Terekhov committed
143
1>          Start  69: solver_test001_sparsekit_drivcav_e20r2000
Kirill Terekhov's avatar
Kirill Terekhov committed
144
1>   69/165 Test  #69: solver_test001_sparsekit_drivcav_e20r2000 ..........   Passed    1.22 sec
Kirill Terekhov's avatar
Kirill Terekhov committed
145
1>          Start  70: solver_test001_sparsekit_drivcav_e20r3000
Kirill Terekhov's avatar
Kirill Terekhov committed
146
1>   70/165 Test  #70: solver_test001_sparsekit_drivcav_e20r3000 ..........   Passed    1.29 sec
Kirill Terekhov's avatar
Kirill Terekhov committed
147
1>          Start  71: solver_test001_sparsekit_drivcav_e20r4000
Kirill Terekhov's avatar
Kirill Terekhov committed
148
1>   71/165 Test  #71: solver_test001_sparsekit_drivcav_e20r4000 ..........   Passed    1.17 sec
Kirill Terekhov's avatar
Kirill Terekhov committed
149
1>          Start  72: solver_test001_sparsekit_drivcav_e20r5000
Kirill Terekhov's avatar
Kirill Terekhov committed
150
1>   72/165 Test  #72: solver_test001_sparsekit_drivcav_e20r5000 ..........   Passed    1.28 sec
Kirill Terekhov's avatar
Kirill Terekhov committed
151
1>          Start  73: solver_test001_sparsekit_drivcav_e30r0000
Kirill Terekhov's avatar
Kirill Terekhov committed
152
1>   73/165 Test  #73: solver_test001_sparsekit_drivcav_e30r0000 ..........   Passed    4.68 sec
Kirill Terekhov's avatar
Kirill Terekhov committed
153
1>          Start  74: solver_test001_sparsekit_drivcav_e30r0100
Kirill Terekhov's avatar
Kirill Terekhov committed
154
1>   74/165 Test  #74: solver_test001_sparsekit_drivcav_e30r0100 ..........   Passed    4.51 sec
Kirill Terekhov's avatar
Kirill Terekhov committed
155
1>          Start  75: solver_test001_sparsekit_drivcav_e30r0500
Kirill Terekhov's avatar
Kirill Terekhov committed
156
1>   75/165 Test  #75: solver_test001_sparsekit_drivcav_e30r0500 ..........   Passed    4.80 sec
Kirill Terekhov's avatar
Kirill Terekhov committed
157
1>          Start  76: solver_test001_sparsekit_drivcav_e30r1000
Kirill Terekhov's avatar
Kirill Terekhov committed
158
1>   76/165 Test  #76: solver_test001_sparsekit_drivcav_e30r1000 ..........   Passed    4.68 sec
Kirill Terekhov's avatar
Kirill Terekhov committed
159
1>          Start  77: solver_test001_sparsekit_drivcav_e30r2000
Kirill Terekhov's avatar
Kirill Terekhov committed
160
1>   77/165 Test  #77: solver_test001_sparsekit_drivcav_e30r2000 ..........   Passed    4.65 sec
Kirill Terekhov's avatar
Kirill Terekhov committed
161
1>          Start  78: solver_test001_sparsekit_drivcav_e30r3000
Kirill Terekhov's avatar
Kirill Terekhov committed
162
1>   78/165 Test  #78: solver_test001_sparsekit_drivcav_e30r3000 ..........   Passed    4.68 sec
Kirill Terekhov's avatar
Kirill Terekhov committed
163
1>          Start  79: solver_test001_sparsekit_drivcav_e30r4000
Kirill Terekhov's avatar
Kirill Terekhov committed
164
1>   79/165 Test  #79: solver_test001_sparsekit_drivcav_e30r4000 ..........   Passed    4.87 sec
Kirill Terekhov's avatar
Kirill Terekhov committed
165
1>          Start  80: solver_test001_sparsekit_drivcav_e30r5000
Kirill Terekhov's avatar
Kirill Terekhov committed
166
1>   80/165 Test  #80: solver_test001_sparsekit_drivcav_e30r5000 ..........   Passed    5.05 sec
Kirill Terekhov's avatar
Kirill Terekhov committed
167
1>          Start  81: solver_test001_sparsekit_drivcav_e40r0000
Kirill Terekhov's avatar
Kirill Terekhov committed
168
1>   81/165 Test  #81: solver_test001_sparsekit_drivcav_e40r0000 ..........   Passed   12.45 sec
Kirill Terekhov's avatar
Kirill Terekhov committed
169
1>          Start  82: solver_test001_sparsekit_drivcav_e40r0100
Kirill Terekhov's avatar
Kirill Terekhov committed
170
1>   82/165 Test  #82: solver_test001_sparsekit_drivcav_e40r0100 ..........   Passed   12.60 sec
Kirill Terekhov's avatar
Kirill Terekhov committed
171
1>          Start  83: solver_test001_sparsekit_drivcav_e40r0500
Kirill Terekhov's avatar
Kirill Terekhov committed
172
1>   83/165 Test  #83: solver_test001_sparsekit_drivcav_e40r0500 ..........   Passed   13.10 sec
Kirill Terekhov's avatar
Kirill Terekhov committed
173
1>          Start  84: solver_test001_sparsekit_drivcav_e40r1000
Kirill Terekhov's avatar
Kirill Terekhov committed
174
1>   84/165 Test  #84: solver_test001_sparsekit_drivcav_e40r1000 ..........   Passed   13.52 sec
Kirill Terekhov's avatar
Kirill Terekhov committed
175
1>          Start  85: solver_test001_sparsekit_drivcav_e40r2000
Kirill Terekhov's avatar
Kirill Terekhov committed
176
1>   85/165 Test  #85: solver_test001_sparsekit_drivcav_e40r2000 ..........   Passed   12.93 sec
Kirill Terekhov's avatar
Kirill Terekhov committed
177
1>          Start  86: solver_test001_sparsekit_drivcav_e40r3000
Kirill Terekhov's avatar
Kirill Terekhov committed
178
1>   86/165 Test  #86: solver_test001_sparsekit_drivcav_e40r3000 ..........   Passed   13.03 sec
Kirill Terekhov's avatar
Kirill Terekhov committed
179
1>          Start  87: solver_test001_sparsekit_drivcav_e40r4000
Kirill Terekhov's avatar
Kirill Terekhov committed
180
1>   87/165 Test  #87: solver_test001_sparsekit_drivcav_e40r4000 ..........   Passed   14.06 sec
Kirill Terekhov's avatar
Kirill Terekhov committed
181
1>          Start  88: solver_test001_sparsekit_drivcav_e40r5000
Kirill Terekhov's avatar
Kirill Terekhov committed
182
1>   88/165 Test  #88: solver_test001_sparsekit_drivcav_e40r5000 ..........   Passed   14.01 sec
Kirill Terekhov's avatar
Kirill Terekhov committed
183
1>          Start  89: solver_test001_sparsekit_fidap_fidap001
Kirill Terekhov's avatar
Kirill Terekhov committed
184
1>   89/165 Test  #89: solver_test001_sparsekit_fidap_fidap001 ............   Passed    0.05 sec
Kirill Terekhov's avatar
Kirill Terekhov committed
185
1>          Start  90: solver_test001_sparsekit_fidap_fidap002
Kirill Terekhov's avatar
Kirill Terekhov committed
186
1>   90/165 Test  #90: solver_test001_sparsekit_fidap_fidap002 ............   Passed    0.12 sec
Kirill Terekhov's avatar
Kirill Terekhov committed
187
1>          Start  91: solver_test001_sparsekit_fidap_fidap003
Kirill Terekhov's avatar
Kirill Terekhov committed
188
1>   91/165 Test  #91: solver_test001_sparsekit_fidap_fidap003 ............   Passed    0.30 sec
Kirill Terekhov's avatar
Kirill Terekhov committed
189
1>          Start  92: solver_test001_sparsekit_fidap_fidap004
Kirill Terekhov's avatar
Kirill Terekhov committed
190
1>   92/165 Test  #92: solver_test001_sparsekit_fidap_fidap004 ............   Passed    0.22 sec
Kirill Terekhov's avatar
Kirill Terekhov committed
191
1>          Start  93: solver_test001_sparsekit_fidap_fidap005
Kirill Terekhov's avatar
Kirill Terekhov committed
192
1>   93/165 Test  #93: solver_test001_sparsekit_fidap_fidap005 ............   Passed    0.02 sec
Kirill Terekhov's avatar
Kirill Terekhov committed
193
1>          Start  94: solver_test001_sparsekit_fidap_fidap006
Kirill Terekhov's avatar
Kirill Terekhov committed
194
1>   94/165 Test  #94: solver_test001_sparsekit_fidap_fidap006 ............***Failed    2.48 sec
Kirill Terekhov's avatar
Kirill Terekhov committed
195
1>          Start  95: solver_test001_sparsekit_fidap_fidap007
Kirill Terekhov's avatar
Kirill Terekhov committed
196
1>   95/165 Test  #95: solver_test001_sparsekit_fidap_fidap007 ............   Passed    0.27 sec
Kirill Terekhov's avatar
Kirill Terekhov committed
197
1>          Start  96: solver_test001_sparsekit_fidap_fidap008
Kirill Terekhov's avatar
Kirill Terekhov committed
198
1>   96/165 Test  #96: solver_test001_sparsekit_fidap_fidap008 ............   Passed    0.51 sec
Kirill Terekhov's avatar
Kirill Terekhov committed
199
1>          Start  97: solver_test001_sparsekit_fidap_fidap009
Kirill Terekhov's avatar
Kirill Terekhov committed
200
1>   97/165 Test  #97: solver_test001_sparsekit_fidap_fidap009 ............   Passed    0.61 sec
Kirill Terekhov's avatar
Kirill Terekhov committed
201
1>          Start  98: solver_test001_sparsekit_fidap_fidap010
Kirill Terekhov's avatar
Kirill Terekhov committed
202
1>   98/165 Test  #98: solver_test001_sparsekit_fidap_fidap010 ............   Passed    0.34 sec
Kirill Terekhov's avatar
Kirill Terekhov committed
203
1>          Start  99: solver_test001_sparsekit_fidap_fidap011
Kirill Terekhov's avatar
Kirill Terekhov committed
204
1>   99/165 Test  #99: solver_test001_sparsekit_fidap_fidap011 ............   Passed   19.66 sec
Kirill Terekhov's avatar
Kirill Terekhov committed
205
1>          Start 100: solver_test001_sparsekit_fidap_fidap012
Kirill Terekhov's avatar
Kirill Terekhov committed
206
1>  100/165 Test #100: solver_test001_sparsekit_fidap_fidap012 ............   Passed    0.41 sec
Kirill Terekhov's avatar
Kirill Terekhov committed
207
1>          Start 101: solver_test001_sparsekit_fidap_fidap013
Kirill Terekhov's avatar
Kirill Terekhov committed
208
1>  101/165 Test #101: solver_test001_sparsekit_fidap_fidap013 ............***Failed   20.16 sec
Kirill Terekhov's avatar
Kirill Terekhov committed
209
1>          Start 102: solver_test001_sparsekit_fidap_fidap014
Kirill Terekhov's avatar
Kirill Terekhov committed
210
1>  102/165 Test #102: solver_test001_sparsekit_fidap_fidap014 ............   Passed    0.45 sec
Kirill Terekhov's avatar
Kirill Terekhov committed
211
1>          Start 103: solver_test001_sparsekit_fidap_fidap015
Kirill Terekhov's avatar
Kirill Terekhov committed
212
1>  103/165 Test #103: solver_test001_sparsekit_fidap_fidap015 ............   Passed    0.50 sec
Kirill Terekhov's avatar
Kirill Terekhov committed
213
1>          Start 104: solver_test001_sparsekit_fidap_fidap018
Kirill Terekhov's avatar
Kirill Terekhov committed
214
1>  104/165 Test #104: solver_test001_sparsekit_fidap_fidap018 ............   Passed    0.53 sec
Kirill Terekhov's avatar
Kirill Terekhov committed
215
1>          Start 105: solver_test001_sparsekit_fidap_fidap019
Kirill Terekhov's avatar
Kirill Terekhov committed
216
1>  105/165 Test #105: solver_test001_sparsekit_fidap_fidap019 ............   Passed    2.00 sec
Kirill Terekhov's avatar
Kirill Terekhov committed
217
1>          Start 106: solver_test001_sparsekit_fidap_fidap020
Kirill Terekhov's avatar
Kirill Terekhov committed
218
1>  106/165 Test #106: solver_test001_sparsekit_fidap_fidap020 ............   Passed    0.33 sec
Kirill Terekhov's avatar
Kirill Terekhov committed
219
1>          Start 107: solver_test001_sparsekit_fidap_fidap021
Kirill Terekhov's avatar
Kirill Terekhov committed
220
1>  107/165 Test #107: solver_test001_sparsekit_fidap_fidap021 ............   Passed    0.09 sec
Kirill Terekhov's avatar
Kirill Terekhov committed
221
1>          Start 108: solver_test001_sparsekit_fidap_fidap022
Kirill Terekhov's avatar
Kirill Terekhov committed
222
1>  108/165 Test #108: solver_test001_sparsekit_fidap_fidap022 ............***Failed    5.55 sec
Kirill Terekhov's avatar
Kirill Terekhov committed
223
1>          Start 109: solver_test001_sparsekit_fidap_fidap023
Kirill Terekhov's avatar
Kirill Terekhov committed
224
1>  109/165 Test #109: solver_test001_sparsekit_fidap_fidap023 ............***Failed    0.23 sec
Kirill Terekhov's avatar
Kirill Terekhov committed
225
1>          Start 110: solver_test001_sparsekit_fidap_fidap024
Kirill Terekhov's avatar
Kirill Terekhov committed
226
1>  110/165 Test #110: solver_test001_sparsekit_fidap_fidap024 ............   Passed    0.30 sec
Kirill Terekhov's avatar
Kirill Terekhov committed
227
1>          Start 111: solver_test001_sparsekit_fidap_fidap025
Kirill Terekhov's avatar
Kirill Terekhov committed
228
1>  111/165 Test #111: solver_test001_sparsekit_fidap_fidap025 ............   Passed    0.12 sec
Kirill Terekhov's avatar
Kirill Terekhov committed
229
1>          Start 112: solver_test001_sparsekit_fidap_fidap026
Kirill Terekhov's avatar
Kirill Terekhov committed
230
1>  112/165 Test #112: solver_test001_sparsekit_fidap_fidap026 ............   Passed    0.47 sec
Kirill Terekhov's avatar
Kirill Terekhov committed
231
1>          Start 113: solver_test001_sparsekit_fidap_fidap027
Kirill Terekhov's avatar
Kirill Terekhov committed
232
1>  113/165 Test #113: solver_test001_sparsekit_fidap_fidap027 ............   Passed    0.20 sec
Kirill Terekhov's avatar
Kirill Terekhov committed
233
1>          Start 114: solver_test001_sparsekit_fidap_fidap028
Kirill Terekhov's avatar
Kirill Terekhov committed
234
1>  114/165 Test #114: solver_test001_sparsekit_fidap_fidap028 ............***Failed   26.94 sec
Kirill Terekhov's avatar
Kirill Terekhov committed
235
1>          Start 115: solver_test001_sparsekit_fidap_fidap029
Kirill Terekhov's avatar
Kirill Terekhov committed
236
1>  115/165 Test #115: solver_test001_sparsekit_fidap_fidap029 ............   Passed    0.14 sec
Kirill Terekhov's avatar
Kirill Terekhov committed
237
1>          Start 116: solver_test001_sparsekit_fidap_fidap031
Kirill Terekhov's avatar
Kirill Terekhov committed
238
1>  116/165 Test #116: solver_test001_sparsekit_fidap_fidap031 ............***Failed    6.32 sec
Kirill Terekhov's avatar
Kirill Terekhov committed
239
1>          Start 117: solver_test001_sparsekit_fidap_fidap032
Kirill Terekhov's avatar
Kirill Terekhov committed
240
1>  117/165 Test #117: solver_test001_sparsekit_fidap_fidap032 ............***Failed    0.08 sec
Kirill Terekhov's avatar
Kirill Terekhov committed
241
1>          Start 118: solver_test001_sparsekit_fidap_fidap033
Kirill Terekhov's avatar
Kirill Terekhov committed
242
1>  118/165 Test #118: solver_test001_sparsekit_fidap_fidap033 ............   Passed    0.09 sec
Kirill Terekhov's avatar
Kirill Terekhov committed
243
1>          Start 119: solver_test001_sparsekit_fidap_fidap035
Kirill Terekhov's avatar
Kirill Terekhov committed
244
1>  119/165 Test #119: solver_test001_sparsekit_fidap_fidap035 ............   Passed    2.42 sec
Kirill Terekhov's avatar
Kirill Terekhov committed
245
1>          Start 120: solver_test001_sparsekit_fidap_fidap036
Kirill Terekhov's avatar
Kirill Terekhov committed
246
1>  120/165 Test #120: solver_test001_sparsekit_fidap_fidap036 ............***Failed  113.13 sec
Kirill Terekhov's avatar
Kirill Terekhov committed
247
1>          Start 121: solver_test001_sparsekit_fidap_fidap037
Kirill Terekhov's avatar
Kirill Terekhov committed
248
1>  121/165 Test #121: solver_test001_sparsekit_fidap_fidap037 ............   Passed    0.36 sec
Kirill Terekhov's avatar
Kirill Terekhov committed
249
1>          Start 122: solver_test001_sparsekit_fidap_fidapm02
Kirill Terekhov's avatar
Kirill Terekhov committed
250
1>  122/165 Test #122: solver_test001_sparsekit_fidap_fidapm02 ............   Passed    0.11 sec
Kirill Terekhov's avatar
Kirill Terekhov committed
251
1>          Start 123: solver_test001_sparsekit_fidap_fidapm03
Kirill Terekhov's avatar
Kirill Terekhov committed
252
1>  123/165 Test #123: solver_test001_sparsekit_fidap_fidapm03 ............   Passed    0.27 sec
Kirill Terekhov's avatar
Kirill Terekhov committed
253
1>          Start 124: solver_test001_sparsekit_fidap_fidapm05
Kirill Terekhov's avatar
Kirill Terekhov committed
254
1>  124/165 Test #124: solver_test001_sparsekit_fidap_fidapm05 ............   Passed    0.02 sec
Kirill Terekhov's avatar
Kirill Terekhov committed
255
1>          Start 125: solver_test001_sparsekit_fidap_fidapm07
Kirill Terekhov's avatar
Kirill Terekhov committed
256
1>  125/165 Test #125: solver_test001_sparsekit_fidap_fidapm07 ............***Failed    0.33 sec
Kirill Terekhov's avatar
Kirill Terekhov committed
257
1>          Start 126: solver_test001_sparsekit_fidap_fidapm08
Kirill Terekhov's avatar
Kirill Terekhov committed
258
1>  126/165 Test #126: solver_test001_sparsekit_fidap_fidapm08 ............   Passed    0.58 sec
Kirill Terekhov's avatar
Kirill Terekhov committed
259
1>          Start 127: solver_test001_sparsekit_fidap_fidapm09
Kirill Terekhov's avatar
Kirill Terekhov committed
260
1>  127/165 Test #127: solver_test001_sparsekit_fidap_fidapm09 ............   Passed    0.76 sec
Kirill Terekhov's avatar
Kirill Terekhov committed
261
1>          Start 128: solver_test001_sparsekit_fidap_fidapm10
Kirill Terekhov's avatar
Kirill Terekhov committed
262
1>  128/165 Test #128: solver_test001_sparsekit_fidap_fidapm10 ............   Passed    0.28 sec
Kirill Terekhov's avatar
Kirill Terekhov committed
263
1>          Start 129: solver_test001_sparsekit_fidap_fidapm11
Kirill Terekhov's avatar
Kirill Terekhov committed
264
1>  129/165 Test #129: solver_test001_sparsekit_fidap_fidapm11 ............   Passed   24.65 sec
Kirill Terekhov's avatar
Kirill Terekhov committed
265
1>          Start 130: solver_test001_sparsekit_fidap_fidapm13
Kirill Terekhov's avatar
Kirill Terekhov committed
266
1>  130/165 Test #130: solver_test001_sparsekit_fidap_fidapm13 ............   Passed    0.41 sec
Kirill Terekhov's avatar
Kirill Terekhov committed
267
1>          Start 131: solver_test001_sparsekit_fidap_fidapm15
Kirill Terekhov's avatar
Kirill Terekhov committed
268
1>  131/165 Test #131: solver_test001_sparsekit_fidap_fidapm15 ............   Passed    0.61 sec
Kirill Terekhov's avatar
Kirill Terekhov committed
269
1>          Start 132: solver_test001_sparsekit_fidap_fidapm29
Kirill Terekhov's avatar
Kirill Terekhov committed
270
1>  132/165 Test #132: solver_test001_sparsekit_fidap_fidapm29 ............***Failed  134.84 sec
Kirill Terekhov's avatar
Kirill Terekhov committed
271
1>          Start 133: solver_test001_sparsekit_fidap_fidapm33
Kirill Terekhov's avatar
Kirill Terekhov committed
272
1>  133/165 Test #133: solver_test001_sparsekit_fidap_fidapm33 ............   Passed    0.16 sec
Kirill Terekhov's avatar
Kirill Terekhov committed
273
1>          Start 134: solver_test001_sparsekit_fidap_fidapm37
Kirill Terekhov's avatar
Kirill Terekhov committed
274 275 276 277 278 279 280 281 282 283 284 285 286 287 288 289 290 291 292 293 294 295 296 297 298 299 300 301 302 303 304 305 306 307 308 309 310 311 312 313 314 315 316 317 318 319 320 321 322 323 324 325 326 327 328 329 330 331 332 333 334 335 336
1>  134/165 Test #134: solver_test001_sparsekit_fidap_fidapm37 ............   Passed    6.22 sec
1>          Start 135: solver_test002_serial_inner_ilu2
1>  135/165 Test #135: solver_test002_serial_inner_ilu2 ...................   Passed    0.37 sec
1>          Start 136: solver_test002_serial_inner_ddpqiluc
1>  136/165 Test #136: solver_test002_serial_inner_ddpqiluc ...............   Passed    2.95 sec
1>          Start 137: solver_test002_serial_inner_mptiluc
1>  137/165 Test #137: solver_test002_serial_inner_mptiluc ................   Passed    2.84 sec
1>          Start 138: solver_test002_serial_petsc
1>  138/165 Test #138: solver_test002_serial_petsc ........................   Passed    0.05 sec
1>          Start 139: solver_test002_serial_trilinos_aztec
1>  139/165 Test #139: solver_test002_serial_trilinos_aztec ...............   Passed    0.06 sec
1>          Start 140: solver_test002_serial_trilinos_belos
1>  140/165 Test #140: solver_test002_serial_trilinos_belos ...............   Passed    0.08 sec
1>          Start 141: solver_test002_serial_trilinos_ifpack
1>  141/165 Test #141: solver_test002_serial_trilinos_ifpack ..............   Passed    0.08 sec
1>          Start 142: solver_test002_serial_trilinos_ml
1>  142/165 Test #142: solver_test002_serial_trilinos_ml ..................   Passed    0.08 sec
1>          Start 143: solver_test002_parallel_inner_ilu2
1>  143/165 Test #143: solver_test002_parallel_inner_ilu2 .................   Passed    0.31 sec
1>          Start 144: solver_test002_parallel_inner_ddpqiluc
1>  144/165 Test #144: solver_test002_parallel_inner_ddpqiluc .............   Passed    0.39 sec
1>          Start 145: solver_test002_parallel_inner_mptiluc
1>  145/165 Test #145: solver_test002_parallel_inner_mptiluc ..............   Passed    0.41 sec
1>          Start 146: solver_test002_parallel_petsc
1>  146/165 Test #146: solver_test002_parallel_petsc ......................   Passed    0.08 sec
1>          Start 147: solver_test002_parallel_trilinos_aztec
1>  147/165 Test #147: solver_test002_parallel_trilinos_aztec .............   Passed    0.09 sec
1>          Start 148: solver_test002_parallel_trilinos_ifpack
1>  148/165 Test #148: solver_test002_parallel_trilinos_ifpack ............   Passed    0.09 sec
1>          Start 149: solver_test002_parallel_trilinos_ml
1>  149/165 Test #149: solver_test002_parallel_trilinos_ml ................   Passed    0.12 sec
1>          Start 150: solver_test002_parallel_trilinos_belos
1>  150/165 Test #150: solver_test002_parallel_trilinos_belos .............   Passed    0.11 sec
1>          Start 151: pmesh_test000_parallel_np_2
1>  151/165 Test #151: pmesh_test000_parallel_np_2 ........................   Passed    0.06 sec
1>          Start 152: pmesh_test000_parallel_np_3
1>  152/165 Test #152: pmesh_test000_parallel_np_3 ........................   Passed    0.08 sec
1>          Start 153: pmesh_test000_parallel_np_4
1>  153/165 Test #153: pmesh_test000_parallel_np_4 ........................   Passed    0.09 sec
1>          Start 154: pmesh_test001_internal_np_2
1>  154/165 Test #154: pmesh_test001_internal_np_2 ........................   Passed    0.09 sec
1>          Start 155: pmesh_test001_internal_np_4
1>  155/165 Test #155: pmesh_test001_internal_np_4 ........................   Passed    0.09 sec
1>          Start 156: pmesh_test001_parmetis_partition_np_2
1>  156/165 Test #156: pmesh_test001_parmetis_partition_np_2 ..............   Passed    0.09 sec
1>          Start 157: pmesh_test001_parmetis_partition_np_4
1>  157/165 Test #157: pmesh_test001_parmetis_partition_np_4 ..............   Passed    0.08 sec
1>          Start 158: pmesh_test001_zoltan_hsfc_np_2
1>  158/165 Test #158: pmesh_test001_zoltan_hsfc_np_2 .....................   Passed    0.06 sec
1>          Start 159: pmesh_test001_zoltan_hsfc_np_4
1>  159/165 Test #159: pmesh_test001_zoltan_hsfc_np_4 .....................   Passed    0.08 sec
1>          Start 160: pmesh_test001_zoltan_rib_np_2
1>  160/165 Test #160: pmesh_test001_zoltan_rib_np_2 ......................   Passed    0.09 sec
1>          Start 161: pmesh_test001_zoltan_rib_np_4
1>  161/165 Test #161: pmesh_test001_zoltan_rib_np_4 ......................   Passed    0.09 sec
1>          Start 162: pmesh_test001_zoltan_rcb_np_2
1>  162/165 Test #162: pmesh_test001_zoltan_rcb_np_2 ......................   Passed    0.06 sec
1>          Start 163: pmesh_test001_zoltan_rcb_np_4
1>  163/165 Test #163: pmesh_test001_zoltan_rcb_np_4 ......................   Passed    0.09 sec
1>          Start 164: pmesh_test001_zoltan_phg_np_2
1>  164/165 Test #164: pmesh_test001_zoltan_phg_np_2 ......................   Passed    0.08 sec
1>          Start 165: pmesh_test001_zoltan_phg_np_4
1>  165/165 Test #165: pmesh_test001_zoltan_phg_np_4 ......................   Passed    0.09 sec
Kirill Terekhov's avatar
Kirill Terekhov committed
337
1>  
Kirill Terekhov's avatar
Kirill Terekhov committed
338
1>  94% tests passed, 10 tests failed out of 165
Kirill Terekhov's avatar
Kirill Terekhov committed
339
1>  
Kirill Terekhov's avatar
Kirill Terekhov committed
340
1>  Total Test time (real) = 560.17 sec
Kirill Terekhov's avatar
Kirill Terekhov committed
341 342 343 344 345 346 347 348
1>  
1>  The following tests FAILED:
1>  	 94 - solver_test001_sparsekit_fidap_fidap006 (Failed)
1>  	101 - solver_test001_sparsekit_fidap_fidap013 (Failed)
1>  	108 - solver_test001_sparsekit_fidap_fidap022 (Failed)
1>  	109 - solver_test001_sparsekit_fidap_fidap023 (Failed)
1>  	114 - solver_test001_sparsekit_fidap_fidap028 (Failed)
1>  	116 - solver_test001_sparsekit_fidap_fidap031 (Failed)
Kirill Terekhov's avatar
Kirill Terekhov committed
349
1>  	117 - solver_test001_sparsekit_fidap_fidap032 (Failed)
Kirill Terekhov's avatar
Kirill Terekhov committed
350 351
1>  	120 - solver_test001_sparsekit_fidap_fidap036 (Failed)
1>  	125 - solver_test001_sparsekit_fidap_fidapm07 (Failed)
Kirill Terekhov's avatar
Kirill Terekhov committed
352
1>  	132 - solver_test001_sparsekit_fidap_fidapm29 (Failed)
Kirill Terekhov's avatar
Kirill Terekhov committed
353 354 355 356 357 358 359 360 361 362 363 364 365 366
1>  Errors while running CTest
1>C:\Program Files (x86)\MSBuild\Microsoft.Cpp\v4.0\Microsoft.CppCommon.targets(113,5): error MSB3073: The command "setlocal
1>C:\Program Files (x86)\MSBuild\Microsoft.Cpp\v4.0\Microsoft.CppCommon.targets(113,5): error MSB3073: "C:\Program Files (x86)\CMake 2.8\bin\ctest.exe" --force-new-ctest-process -C Release
1>C:\Program Files (x86)\MSBuild\Microsoft.Cpp\v4.0\Microsoft.CppCommon.targets(113,5): error MSB3073: if %errorlevel% neq 0 goto :cmEnd
1>C:\Program Files (x86)\MSBuild\Microsoft.Cpp\v4.0\Microsoft.CppCommon.targets(113,5): error MSB3073: :cmEnd
1>C:\Program Files (x86)\MSBuild\Microsoft.Cpp\v4.0\Microsoft.CppCommon.targets(113,5): error MSB3073: endlocal & call :cmErrorLevel %errorlevel% & goto :cmDone
1>C:\Program Files (x86)\MSBuild\Microsoft.Cpp\v4.0\Microsoft.CppCommon.targets(113,5): error MSB3073: :cmErrorLevel
1>C:\Program Files (x86)\MSBuild\Microsoft.Cpp\v4.0\Microsoft.CppCommon.targets(113,5): error MSB3073: exit /b %1
1>C:\Program Files (x86)\MSBuild\Microsoft.Cpp\v4.0\Microsoft.CppCommon.targets(113,5): error MSB3073: :cmDone
1>C:\Program Files (x86)\MSBuild\Microsoft.Cpp\v4.0\Microsoft.CppCommon.targets(113,5): error MSB3073: if %errorlevel% neq 0 goto :VCEnd
1>C:\Program Files (x86)\MSBuild\Microsoft.Cpp\v4.0\Microsoft.CppCommon.targets(113,5): error MSB3073: :VCEnd" exited with code 8.
1>
1>Build FAILED.
1>
Kirill Terekhov's avatar
Kirill Terekhov committed
367 368
1>Time Elapsed 00:09:20.32
========== Build: 0 succeeded, 1 failed, 0 up-to-date, 0 skipped ==========