Update .gitlab-ci.yml

4 jobs for master in 8 minutes and 34 seconds (queued for 2 minutes and 2 seconds)
Status Job ID Name Coverage
  Build
failed #437
build_debug

00:03:41

passed #438
build_opt

00:04:53

 
  Test
skipped #439
test_debug
skipped #440
test_opt
 
Name Stage Failure
failed
build_debug Build There is an unknown failure, please try again
cd /opt/gitlab-ci-multi-runner/builds/fe725eaf/0/terekhov/INMOST-developement/build_debug/Examples/FVDiscr && /usr/bin/cmake -E cmake_link_script CMakeFiles/FVDiscr.dir/link.txt --verbose=1
/usr/bin/c++ -O0 -g -fopenmp -rdynamic -Wl,-rpath -Wl,/usr/lib64 -Wl,--enable-new-dtags CMakeFiles/FVDiscr.dir/main.cpp.o -o FVDiscr ../../libinmost.a -lmpi_cxx -lmpi
collect2: error: ld returned 1 exit status
make[2]: *** [Examples/FVDiscr/CMakeFiles/FVDiscr.dir/build.make:98: Examples/FVDiscr/FVDiscr] Error 1
make[2]: Leaving directory '/opt/gitlab-ci-multi-runner/builds/fe725eaf/0/terekhov/INMOST-developement/build_debug'
make[1]: *** [CMakeFiles/Makefile2:2643: Examples/FVDiscr/CMakeFiles/FVDiscr.dir/all] Error 2
make[1]: Leaving directory '/opt/gitlab-ci-multi-runner/builds/fe725eaf/0/terekhov/INMOST-developement/build_debug'
make: *** [Makefile:163: all] Error 2
ERROR: Job failed: exit status 1