4 jobs for master in 7 minutes and 10 seconds (queued for 46 seconds)
Status Job ID Name Coverage
  Build
failed #454
build_debug

00:02:18

passed #455
build_opt

00:04:52

 
  Test
skipped #456
test_debug
skipped #457
test_opt
 
Name Stage Failure
failed
build_debug Build There is an unknown failure, please try again
cd /opt/gitlab-ci-multi-runner/builds/fe725eaf/0/terekhov/INMOST-developement/build_debug/Tests/pmesh_test001 && /usr/bin/cmake -E cmake_link_script CMakeFiles/pmesh_test001.dir/link.txt --verbose=1
/usr/bin/c++ -O0 -g -fopenmp -rdynamic -Wl,-rpath -Wl,/usr/lib64 -Wl,--enable-new-dtags CMakeFiles/pmesh_test001.dir/main.cpp.o -o pmesh_test001 ../../libinmost.a -lmpi_cxx -lmpi
collect2: error: ld returned 1 exit status
make[2]: *** [Tests/pmesh_test001/CMakeFiles/pmesh_test001.dir/build.make:98: Tests/pmesh_test001/pmesh_test001] Error 1
make[2]: Leaving directory '/opt/gitlab-ci-multi-runner/builds/fe725eaf/0/terekhov/INMOST-developement/build_debug'
make[1]: *** [CMakeFiles/Makefile2:1870: Tests/pmesh_test001/CMakeFiles/pmesh_test001.dir/all] Error 2
make[1]: Leaving directory '/opt/gitlab-ci-multi-runner/builds/fe725eaf/0/terekhov/INMOST-developement/build_debug'
make: *** [Makefile:163: all] Error 2
ERROR: Job failed: exit status 1