Update .gitlab-ci.yml

4 jobs for master in 6 minutes and 55 seconds (queued for 3 minutes and 55 seconds)
Status Job ID Name Coverage
  Build
failed #458
build_debug

00:02:06

passed #459
build_opt

00:04:49

 
  Test
skipped #460
test_debug
skipped #461
test_opt
 
Name Stage Failure
failed
build_debug Build There is an unknown failure, please try again
cd /opt/gitlab-ci-multi-runner/builds/fe725eaf/0/terekhov/INMOST-developement/build_debug/Tests/solver_test002 && /usr/bin/cmake -E cmake_link_script CMakeFiles/solver_test002.dir/link.txt --verbose=1
/usr/bin/c++ -fopenmp -g -rdynamic -Wl,-rpath -Wl,/usr/lib64 -Wl,--enable-new-dtags CMakeFiles/solver_test002.dir/main.cpp.o -o solver_test002 ../../libinmost.a -lmpi_cxx -lmpi
collect2: error: ld returned 1 exit status
make[2]: *** [Tests/solver_test002/CMakeFiles/solver_test002.dir/build.make:98: Tests/solver_test002/solver_test002] Error 1
make[2]: Leaving directory '/opt/gitlab-ci-multi-runner/builds/fe725eaf/0/terekhov/INMOST-developement/build_debug'
make[1]: *** [CMakeFiles/Makefile2:1705: Tests/solver_test002/CMakeFiles/solver_test002.dir/all] Error 2
make[1]: Leaving directory '/opt/gitlab-ci-multi-runner/builds/fe725eaf/0/terekhov/INMOST-developement/build_debug'
make: *** [Makefile:163: all] Error 2
ERROR: Job failed: exit status 1