4 jobs for master in 6 minutes and 35 seconds (queued for 35 seconds)
Status Job ID Name Coverage
  Build
failed #462
build_debug

00:01:47

passed #463
build_opt

00:04:48

 
  Test
skipped #464
test_debug
skipped #465
test_opt
 
Name Stage Failure
failed
build_debug Build There is an unknown failure, please try again
/usr/bin/ranlib libinmost.a
/usr/bin/ranlib: libinmost.a: No space left on device
make[2]: *** [CMakeFiles/inmost.dir/build.make:1370: libinmost.a] Error 1
make[2]: *** Deleting file 'libinmost.a'
make[2]: Leaving directory '/opt/gitlab-ci-multi-runner/builds/fe725eaf/0/terekhov/INMOST-developement/build_debug'
make[1]: *** [CMakeFiles/Makefile2:932: CMakeFiles/inmost.dir/all] Error 2
make[1]: Leaving directory '/opt/gitlab-ci-multi-runner/builds/fe725eaf/0/terekhov/INMOST-developement/build_debug'
make: *** [Makefile:163: all] Error 2
ERROR: Job failed: exit status 1