Fixes

4 jobs for master in 6 minutes and 54 seconds (queued for 56 seconds)
Status Job ID Name Coverage
  Build
passed #498
build_debug

00:02:28

failed #499
build_opt

00:04:26

 
  Test
skipped #500
test_debug
skipped #501
test_opt
 
Name Stage Failure
failed
build_opt Build There is an unknown failure, please try again
/opt/gitlab-ci-multi-runner/builds/fe725eaf/0/terekhov/INMOST/Examples/ADFVDiscr/main.cpp:332:37: error: expected unqualified-id before ‘+’ token
#pragma omp for reduction(+:err_L2, +:vol)
^
make[2]: *** [Examples/ADFVDiscr/CMakeFiles/ADFVDiscr.dir/build.make:63: Examples/ADFVDiscr/CMakeFiles/ADFVDiscr.dir/main.cpp.o] Error 1
make[2]: Leaving directory '/opt/gitlab-ci-multi-runner/builds/fe725eaf/0/terekhov/INMOST/build_opt'
make[1]: *** [CMakeFiles/Makefile2:3032: Examples/ADFVDiscr/CMakeFiles/ADFVDiscr.dir/all] Error 2
make[1]: Leaving directory '/opt/gitlab-ci-multi-runner/builds/fe725eaf/0/terekhov/INMOST/build_opt'
make: *** [Makefile:163: all] Error 2
ERROR: Job failed: exit status 1