Untested code for edge collapse

4 jobs for master in 5 minutes and 3 seconds (queued for 1 minute and 40 seconds)
Status Job ID Name Coverage
  Build
failed #618
build_debug

00:00:36

failed #619
build_opt

00:04:27

 
  Test
skipped #620
test_debug
skipped #621
test_opt
 
Name Stage Failure
failed
build_debug Build There is an unknown failure, please try again
     assert( !((nodes[0] == n1 || nodes[0] == n2) &&
^
/opt/gitlab-ci-multi-runner/builds/fe725eaf/0/terekhov/INMOST/Source/Mesh/modify.cpp:1149:46: note: suggested alternative: ‘nn’
make[2]: *** [CMakeFiles/inmost.dir/build.make:375: CMakeFiles/inmost.dir/Source/Mesh/modify.cpp.o] Error 1
make[2]: Leaving directory '/opt/gitlab-ci-multi-runner/builds/fe725eaf/0/terekhov/INMOST/build_debug'
make[1]: *** [CMakeFiles/Makefile2:932: CMakeFiles/inmost.dir/all] Error 2
make[1]: Leaving directory '/opt/gitlab-ci-multi-runner/builds/fe725eaf/0/terekhov/INMOST/build_debug'
make: *** [Makefile:163: all] Error 2
ERROR: Job failed: exit status 1
failed
build_opt Build There is an unknown failure, please try again
   std::cout << A.EdgeMaxLocalID() << " edges in the mesh" << std::endl;;
^~~~~~~~~~~~~~
EdgeByLocalID
make[2]: *** [Examples/GridTools/CMakeFiles/check_collapse.dir/build.make:63: Examples/GridTools/CMakeFiles/check_collapse.dir/check_collapse.cpp.o] Error 1
make[2]: Leaving directory '/opt/gitlab-ci-multi-runner/builds/fe725eaf/0/terekhov/INMOST/build_opt'
make[1]: *** [CMakeFiles/Makefile2:2839: Examples/GridTools/CMakeFiles/check_collapse.dir/all] Error 2
make[1]: Leaving directory '/opt/gitlab-ci-multi-runner/builds/fe725eaf/0/terekhov/INMOST/build_opt'
make: *** [Makefile:163: all] Error 2
ERROR: Job failed: exit status 1